Uploaded image for project: 'HPCC'
  1. HPCC
  2. HPCC-23995

Build error on master in release mode

    Details

    • Type: Bug
    • Status: Resolved
    • Priority: Blocker
    • Resolution: Fixed
    • Affects Version/s: 7.10.0
    • Fix Version/s: 7.10.0
    • Component/s: ESDL
    • Labels:
      None

      Description

      In member function 'void CEsdlCustomTransform::verifyPrefixDeclared(IPropertyTree&, const char*)',
      4494
      inlined from 'CEsdlCustomTransform::CEsdlCustomTransform(IPropertyTree&, const char*)' at /hpcc-dev/HPCC-Platform/esp/esdllib/esdl_script.cpp:695:41:
      4495
      /hpcc-dev/HPCC-Platform/esp/esdllib/esdl_script.cpp:680:38: error: '%s' directive argument is null [-Werror=format-overflow=]
      4496
      680 | throw MakeStringException(ESDL_SCRIPT_Error, "Undeclared script xmlns prefix %s", prefix);
      4497
      cc1plus: some warnings being treated as errors
      4498
      make[2]: *** [esp/esdllib/CMakeFiles/esdllib.dir/build.make:102: esp/esdllib/CMakeFiles/esdllib.dir/esdl_script.cpp.o] Error 1
      4499
      make[1]: *** [CMakeFiles/Makefile2:12343: esp/esdllib/CMakeFiles/esdllib.dir/all] Error 2
      4500
      make[1]: *** Waiting for unfinished jobs....
      4501

        Attachments

          Activity

            People

            • Assignee:
              afishbeck Anthony Fishbeck
              Reporter:
              richardkchapman Richard Chapman
            • Votes:
              0 Vote for this issue
              Watchers:
              2 Start watching this issue

              Dates

              • Created:
                Updated:
                Resolved: