Uploaded image for project: 'HPCC'
  1. HPCC
  2. HPCC-23032

7.6.6-rc1 SQS plugin failed on Ubuntu 19.10

    Details

    • Type: Task
    • Status: Resolved
    • Priority: Minor
    • Resolution: Fixed
    • Affects Version/s: None
    • Fix Version/s: 7.8.0
    • Component/s: Plugins
    • Labels:
      None

      Description

      Build log:
      10:26:18 /mnt/disk1/jenkins/workspace/CE-Eoan-Plugins-7.6.6-rc1/CE/ubuntu-19.10-amd64/HPCC-Platform/plugins/sqs/aws-sdk-cpp/aws-cpp-sdk-core/source/client/AWSClient.cpp: In member function ‘virtual Aws::Client::AWSError<Aws::Client::CoreErrors> Aws::Client::AWSJsonClient::BuildAWSError(const std::shared_ptr<Aws::Http::HttpResponse>&) const’:
      10:26:18 /mnt/disk1/jenkins/workspace/CE-Eoan-Plugins-7.6.6-rc1/CE/ubuntu-19.10-amd64/HPCC-Platform/plugins/sqs/aws-sdk-cpp/aws-cpp-sdk-core/source/client/AWSClient.cpp:561:111: error: implicitly-declared ‘Aws::Client::AWSError<Aws::Client::CoreErrors>& Aws::Client::AWSError<Aws::Client::CoreErrors>::operator=(const Aws::Client::AWSError<Aws::Client::CoreErrors>&)’ is deprecated [-Werror=deprecated-copy]
      10:26:18 561 | error = AWSError<CoreErrors>(CoreErrors::NETWORK_CONNECTION, "", "Unable to connect to endpoint", true);
      10:26:18 | ^
      10:26:18 In file included from /mnt/disk1/jenkins/workspace/CE-Eoan-Plugins-7.6.6-rc1/CE/ubuntu-19.10-amd64/HPCC-Platform/plugins/sqs/aws-sdk-cpp/aws-cpp-sdk-core/source/client/AWSClient.cpp:19:
      10:26:18 /mnt/disk1/jenkins/workspace/CE-Eoan-Plugins-7.6.6-rc1/CE/ubuntu-19.10-amd64/HPCC-Platform/plugins/sqs/aws-sdk-cpp/aws-cpp-sdk-core/include/aws/core/client/AWSError.h:52:13: note: because ‘Aws::Client::AWSError<Aws::Client::CoreErrors>’ has user-provided ‘Aws::Client::AWSError<ERROR_TYPE>::AWSError(const Aws::Client::AWSError<Aws::Client::CoreErrors>&) [with ERROR_TYPE = Aws::Client::CoreErrors]
      10:26:18 52 | AWSError(const AWSError<CoreErrors>& rhs) :
      10:26:18 | ^~~~~~~~
      10:26:18 /mnt/disk1/jenkins/workspace/CE-Eoan-Plugins-7.6.6-rc1/CE/ubuntu-19.10-amd64/HPCC-Platform/plugins/sqs/aws-sdk-cpp/aws-cpp-sdk-core/source/client/AWSClient.cpp:574:54: error: implicitly-declared ‘Aws::Client::AWSError<Aws::Client::CoreErrors>& Aws::Client::AWSError<Aws::Client::CoreErrors>::operator=(const Aws::Client::AWSError<Aws::Client::CoreErrors>&)’ is deprecated [-Werror=deprecated-copy]
      10:26:18 574 | isRetryableHttpResponseCode(responseCode));
      10:26:18 | ^
      10:26:18 In file included from /mnt/disk1/jenkins/workspace/CE-Eoan-Plugins-7.6.6-rc1/CE/ubuntu-19.10-amd64/HPCC-Platform/plugins/sqs/aws-sdk-cpp/aws-cpp-sdk-core/source/client/AWSClient.cpp:19:
      10:26:18 /mnt/disk1/jenkins/workspace/CE-Eoan-Plugins-7.6.6-rc1/CE/ubuntu-19.10-amd64/HPCC-Platform/plugins/sqs/aws-sdk-cpp/aws-cpp-sdk-core/include/aws/core/client/AWSError.h:52:13: note: because ‘Aws::Client::AWSError<Aws::Client::CoreErrors>’ has user-provided ‘Aws::Client::AWSError<ERROR_TYPE>::AWSError(const Aws::Client::AWSError<Aws::Client::CoreErrors>&) [with ERROR_TYPE = Aws::Client::CoreErrors]
      10:26:18 52 | AWSError(const AWSError<CoreErrors>& rhs) :
      10:26:18 | ^~~~~~~~
      10:26:18 /mnt/disk1/jenkins/workspace/CE-Eoan-Plugins-7.6.6-rc1/CE/ubuntu-19.10-amd64/HPCC-Platform/plugins/sqs/aws-sdk-cpp/aws-cpp-sdk-core/source/client/AWSClient.cpp:589:103: error: implicitly-declared ‘Aws::Client::AWSError<Aws::Client::CoreErrors>& Aws::Client::AWSError<Aws::Client::CoreErrors>::operator=(const Aws::Client::AWSError<Aws::Client::CoreErrors>&)’ is deprecated [-Werror=deprecated-copy]
      10:26:18 589 | error = GetErrorMarshaller()>Marshall(httpResponse>GetHeader(ERROR_TYPE_HEADER), message);
      10:26:18 | ^
      10:26:18 In file included from /mnt/disk1/jenkins/workspace/CE-Eoan-Plugins-7.6.6-rc1/CE/ubuntu-19.10-amd64/HPCC-Platform/plugins/sqs/aws-sdk-cpp/aws-cpp-sdk-core/source/client/AWSClient.cpp:19:
      10:26:18 /mnt/disk1/jenkins/workspace/CE-Eoan-Plugins-7.6.6-rc1/CE/ubuntu-19.10-amd64/HPCC-Platform/plugins/sqs/aws-sdk-cpp/aws-cpp-sdk-core/include/aws/core/client/AWSError.h:52:13: note: because ‘Aws::Client::AWSError<Aws::Client::CoreErrors>’ has user-provided ‘Aws::Client::AWSError<ERROR_TYPE>::AWSError(const Aws::Client::AWSError<Aws::Client::CoreErrors>&) [with ERROR_TYPE = Aws::Client::CoreErrors]
      10:26:18 52 | AWSError(const AWSError<CoreErrors>& rhs) :
      10:26:18 | ^~~~~~~~
      10:26:18 /mnt/disk1/jenkins/workspace/CE-Eoan-Plugins-7.6.6-rc1/CE/ubuntu-19.10-amd64/HPCC-Platform/plugins/sqs/aws-sdk-cpp/aws-cpp-sdk-core/source/client/AWSClient.cpp:593:93: error: implicitly-declared ‘Aws::Client::AWSError<Aws::Client::CoreErrors>& Aws::Client::AWSError<Aws::Client::CoreErrors>::operator=(const Aws::Client::AWSError<Aws::Client::CoreErrors>&)’ is deprecated [-Werror=deprecated-copy]
      10:26:18 593 | error = GetErrorMarshaller()->Marshall(exceptionPayload.GetString(TYPE), message);
      10:26:18 | ^
      10:26:18 In file included from /mnt/disk1/jenkins/workspace/CE-Eoan-Plugins-7.6.6-rc1/CE/ubuntu-19.10-amd64/HPCC-Platform/plugins/sqs/aws-sdk-cpp/aws-cpp-sdk-core/source/client/AWSClient.cpp:19:
      10:26:18 /mnt/disk1/jenkins/workspace/CE-Eoan-Plugins-7.6.6-rc1/CE/ubuntu-19.10-amd64/HPCC-Platform/plugins/sqs/aws-sdk-cpp/aws-cpp-sdk-core/include/aws/core/client/AWSError.h:52:13: note: because ‘Aws::Client::AWSError<Aws::Client::CoreErrors>’ has user-provided ‘Aws::Client::AWSError<ERROR_TYPE>::AWSError(const Aws::Client::AWSError<Aws::Client::CoreErrors>&) [with ERROR_TYPE = Aws::Client::CoreErrors]
      10:26:18 52 | AWSError(const AWSError<CoreErrors>& rhs) :
      10:26:18 | ^~~~~~~~
      10:26:18 /mnt/disk1/jenkins/workspace/CE-Eoan-Plugins-7.6.6-rc1/CE/ubuntu-19.10-amd64/HPCC-Platform/plugins/sqs/aws-sdk-cpp/aws-cpp-sdk-core/source/client/AWSClient.cpp:597:81: error: implicitly-declared ‘Aws::Client::AWSError<Aws::Client::CoreErrors>& Aws::Client::AWSError<Aws::Client::CoreErrors>::operator=(const Aws::Client::AWSError<Aws::Client::CoreErrors>&)’ is deprecated [-Werror=deprecated-copy]
      10:26:18 597 | error = AWSError<CoreErrors>(CoreErrors::UNKNOWN, "", message, false);
      10:26:18 | ^
      10:26:18 In file included from /mnt/disk1/jenkins/workspace/CE-Eoan-Plugins-7.6.6-rc1/CE/ubuntu-19.10-amd64/HPCC-Platform/plugins/sqs/aws-sdk-cpp/aws-cpp-sdk-core/source/client/AWSClient.cpp:19:
      10:26:18 /mnt/disk1/jenkins/workspace/CE-Eoan-Plugins-7.6.6-rc1/CE/ubuntu-19.10-amd64/HPCC-Platform/plugins/sqs/aws-sdk-cpp/aws-cpp-sdk-core/include/aws/core/client/AWSError.h:52:13: note: because ‘Aws::Client::AWSError<Aws::Client::CoreErrors>’ has user-provided ‘Aws::Client::AWSError<ERROR_TYPE>::AWSError(const Aws::Client::AWSError<Aws::Client::CoreErrors>&) [with ERROR_TYPE = Aws::Client::CoreErrors]
      10:26:18 52 | AWSError(const AWSError<CoreErrors>& rhs) :
      10:26:18 | ^~~~~~~~
      10:26:18 /mnt/disk1/jenkins/workspace/CE-Eoan-Plugins-7.6.6-rc1/CE/ubuntu-19.10-amd64/HPCC-Platform/plugins/sqs/aws-sdk-cpp/aws-cpp-sdk-core/source/client/AWSClient.cpp: In member function ‘virtual Aws::Client::AWSError<Aws::Client::CoreErrors> Aws::Client::AWSXMLClient::BuildAWSError(const std::shared_ptr<Aws::Http::HttpResponse>&) const’:
      10:26:18 /mnt/disk1/jenkins/workspace/CE-Eoan-Plugins-7.6.6-rc1/CE/ubuntu-19.10-amd64/HPCC-Platform/plugins/sqs/aws-sdk-cpp/aws-cpp-sdk-core/source/client/AWSClient.cpp:680:54: error: implicitly-declared ‘Aws::Client::AWSError<Aws::Client::CoreErrors>& Aws::Client::AWSError<Aws::Client::CoreErrors>::operator=(const Aws::Client::AWSError<Aws::Client::CoreErrors>&)’ is deprecated [-Werror=deprecated-copy]
      10:26:18 680 | isRetryableHttpResponseCode(responseCode));
      10:26:18 | ^
      10:26:18 In file included from /mnt/disk1/jenkins/workspace/CE-Eoan-Plugins-7.6.6-rc1/CE/ubuntu-19.10-amd64/HPCC-Platform/plugins/sqs/aws-sdk-cpp/aws-cpp-sdk-core/source/client/AWSClient.cpp:19:
      10:26:18 /mnt/disk1/jenkins/workspace/CE-Eoan-Plugins-7.6.6-rc1/CE/ubuntu-19.10-amd64/HPCC-Platform/plugins/sqs/aws-sdk-cpp/aws-cpp-sdk-core/include/aws/core/client/AWSError.h:52:13: note: because ‘Aws::Client::AWSError<Aws::Client::CoreErrors>’ has user-provided ‘Aws::Client::AWSError<ERROR_TYPE>::AWSError(const Aws::Client::AWSError<Aws::Client::CoreErrors>&) [with ERROR_TYPE = Aws::Client::CoreErrors]
      10:26:18 52 | AWSError(const AWSError<CoreErrors>& rhs) :
      10:26:18 | ^~~~~~~~
      10:26:18 /mnt/disk1/jenkins/workspace/CE-Eoan-Plugins-7.6.6-rc1/CE/ubuntu-19.10-amd64/HPCC-Platform/plugins/sqs/aws-sdk-cpp/aws-cpp-sdk-core/source/client/AWSClient.cpp:721:73: error: implicitly-declared ‘Aws::Client::AWSError<Aws::Client::CoreErrors>& Aws::Client::AWSError<Aws::Client::CoreErrors>::operator=(const Aws::Client::AWSError<Aws::Client::CoreErrors>&)’ is deprecated [-Werror=deprecated-copy]
      10:26:18 721 | StringUtils::Trim(messageNode.GetText().c_str()));
      10:26:18 | ^
      10:26:18 In file included from /mnt/disk1/jenkins/workspace/CE-Eoan-Plugins-7.6.6-rc1/CE/ubuntu-19.10-amd64/HPCC-Platform/plugins/sqs/aws-sdk-cpp/aws-cpp-sdk-core/source/client/AWSClient.cpp:19:
      10:26:18 /mnt/disk1/jenkins/workspace/CE-Eoan-Plugins-7.6.6-rc1/CE/ubuntu-19.10-amd64/HPCC-Platform/plugins/sqs/aws-sdk-cpp/aws-cpp-sdk-core/include/aws/core/client/AWSError.h:52:13: note: because ‘Aws::Client::AWSError<Aws::Client::CoreErrors>’ has user-provided ‘Aws::Client::AWSError<ERROR_TYPE>::AWSError(const Aws::Client::AWSError<Aws::Client::CoreErrors>&) [with ERROR_TYPE = Aws::Client::CoreErrors]
      10:26:18 52 | AWSError(const AWSError<CoreErrors>& rhs) :
      10:26:18 | ^~~~~~~~
      10:26:18 /mnt/disk1/jenkins/workspace/CE-Eoan-Plugins-7.6.6-rc1/CE/ubuntu-19.10-amd64/HPCC-Platform/plugins/sqs/aws-sdk-cpp/aws-cpp-sdk-core/source/client/AWSClient.cpp:733:118: error: implicitly-declared ‘Aws::Client::AWSError<Aws::Client::CoreErrors>& Aws::Client::AWSError<Aws::Client::CoreErrors>::operator=(const Aws::Client::AWSError<Aws::Client::CoreErrors>&)’ is deprecated [-Werror=deprecated-copy]
      10:26:18 733 | error = GetErrorMarshaller()->Marshall(StringUtils::Trim(doc.GetErrorMessage().c_str()), ss.str().c_str());
      10:26:18 | ^
      10:26:18 In file included from /mnt/disk1/jenkins/workspace/CE-Eoan-Plugins-7.6.6-rc1/CE/ubuntu-19.10-amd64/HPCC-Platform/plugins/sqs/aws-sdk-cpp/aws-cpp-sdk-core/source/client/AWSClient.cpp:19:
      10:26:18 /mnt/disk1/jenkins/workspace/CE-Eoan-Plugins-7.6.6-rc1/CE/ubuntu-19.10-amd64/HPCC-Platform/plugins/sqs/aws-sdk-cpp/aws-cpp-sdk-core/include/aws/core/client/AWSError.h:52:13: note: because ‘Aws::Client::AWSError<Aws::Client::CoreErrors>’ has user-provided ‘Aws::Client::AWSError<ERROR_TYPE>::AWSError(const Aws::Client::AWSError<Aws::Client::CoreErrors>&) [with ERROR_TYPE = Aws::Client::CoreErrors]
      10:26:18 52 | AWSError(const AWSError<CoreErrors>& rhs) :
      10:26:18 | ^~~~~~~~
      10:26:18 In file included from /mnt/disk1/jenkins/workspace/CE-Eoan-Plugins-7.6.6-rc1/CE/ubuntu-19.10-amd64/HPCC-Platform/plugins/sqs/aws-sdk-cpp/aws-cpp-sdk-core/source/client/AWSClient.cpp:29:
      10:26:18 /mnt/disk1/jenkins/workspace/CE-Eoan-Plugins-7.6.6-rc1/CE/ubuntu-19.10-amd64/HPCC-Platform/plugins/sqs/aws-sdk-cpp/aws-cpp-sdk-core/include/aws/core/utils/Outcome.h: In instantiation of ‘Aws::Utils::Outcome<R, E>& Aws::Utils::Outcome<R, E>::operator=(Aws::Utils::Outcome<R, E>&&) [with R = std::shared_ptr<Aws::Http::HttpResponse>; E = Aws::Client::AWSError<Aws::Client::CoreErrors>]’:
      10:26:18 /mnt/disk1/jenkins/workspace/CE-Eoan-Plugins-7.6.6-rc1/CE/ubuntu-19.10-amd64/HPCC-Platform/plugins/sqs/aws-sdk-cpp/aws-cpp-sdk-core/source/client/AWSClient.cpp:195:27: required from here
      10:26:18 /mnt/disk1/jenkins/workspace/CE-Eoan-Plugins-7.6.6-rc1/CE/ubuntu-19.10-amd64/HPCC-Platform/plugins/sqs/aws-sdk-cpp/aws-cpp-sdk-core/include/aws/core/utils/Outcome.h:84:27: error: implicitly-declared ‘Aws::Client::AWSError<Aws::Client::CoreErrors>& Aws::Client::AWSError<Aws::Client::CoreErrors>::operator=(const Aws::Client::AWSError<Aws::Client::CoreErrors>&)’ is deprecated [-Werror=deprecated-copy]
      10:26:18 84 | error = std::move(o.error);
      10:26:18 | ~~~~~^~~~~~~~~~~~~~~~~~~
      10:26:18 In file included from /mnt/disk1/jenkins/workspace/CE-Eoan-Plugins-7.6.6-rc1/CE/ubuntu-19.10-amd64/HPCC-Platform/plugins/sqs/aws-sdk-cpp/aws-cpp-sdk-core/source/client/AWSClient.cpp:19:
      10:26:18 /mnt/disk1/jenkins/workspace/CE-Eoan-Plugins-7.6.6-rc1/CE/ubuntu-19.10-amd64/HPCC-Platform/plugins/sqs/aws-sdk-cpp/aws-cpp-sdk-core/include/aws/core/client/AWSError.h:52:13: note: because ‘Aws::Client::AWSError<Aws::Client::CoreErrors>’ has user-provided ‘Aws::Client::AWSError<ERROR_TYPE>::AWSError(const Aws::Client::AWSError<Aws::Client::CoreErrors>&) [with ERROR_TYPE = Aws::Client::CoreErrors]
      10:26:18 52 | AWSError(const AWSError<CoreErrors>& rhs) :
      10:26:18 | ^~~~~~~~
      10:26:19 cc1plus: all warnings being treated as errors
      10:26:19 make[6]: *** [aws-cpp-sdk-core/CMakeFiles/aws-cpp-sdk-core.dir/build.make:190: aws-cpp-sdk-core/CMakeFiles/aws-cpp-sdk-core.dir/source/client/AWSClient.cpp.o] Error 1
      10:26:19 make[5]: *** [CMakeFiles/Makefile2:5246: aws-cpp-sdk-core/CMakeFiles/aws-cpp-sdk-core.dir/all] Error 2
      10:26:19 make[4]: *** [CMakeFiles/Makefile2:4205: aws-cpp-sdk-sqs/CMakeFiles/aws-cpp-sdk-sqs.dir/rule] Error 2
      10:26:19 make[3]: *** [Makefile:1139: aws-cpp-sdk-sqs] Error 2
      10:26:19 make[2]: *** [plugins/sqs/CMakeFiles/aws-sdk-cpp.dir/build.make:111: plugins/sqs/aws-sdk-cpp-prefix/src/aws-sdk-cpp-stamp/aws-sdk-cpp-build] Error 2
      10:26:19 make[1]: *** [CMakeFiles/Makefile2:1577: plugins/sqs/CMakeFiles/aws-sdk-cpp.dir/all] Error 2
      10:26:19 make[1]: *** Waiting for unfinished jobs....
      10:26:19 [ 23%] Building CXX object dali/base/CMakeFiles/dalibase.dir/dasess.cpp.o
      10:26:23 [ 24%] Building CXX object dali/base/CMakeFiles/dalibase.dir/dasubs.cpp.o
      10:26:25 [ 25%] Building CXX object dali/base/CMakeFiles/dalibase.dir/dautils.cpp.o
      10:26:30 [ 25%] Linking CXX shared library ../../Release/libs/libdalibase.so
      10:26:31 /mnt/disk1/jenkins/workspace/CE-Eoan-Plugins-7.6.6-rc1/CE/ubuntu-19.10-amd64/HPCC-Platform/system/tbb_sm/tbb/./build/Makefile.tbb:28: CONFIG: cfg=release arch=intel64 compiler=gcc target=linux runtime=cc9.2.1_libc2.30_kernel5.3.0
      10:26:31 [ 25%] Built target dalibase
      10:26:31 In file included from /mnt/disk1/jenkins/workspace/CE-Eoan-Plugins-7.6.6-rc1/CE/ubuntu-19.10-amd64/HPCC-Platform/system/tbb_sm/tbb/./src/tbb/concurrent_hash_map.cpp:17:
      10:26:31 /mnt/disk1/jenkins/workspace/CE-Eoan-Plugins-7.6.6-rc1/CE/ubuntu-19.10-amd64/HPCC-Platform/system/tbb_sm/tbb/./include/tbb/concurrent_hash_map.h: In constructor ‘tbb::interface5::internal::hash_map_base::hash_map_base()’:
      10:26:31 /mnt/disk1/jenkins/workspace/CE-Eoan-Plugins-7.6.6-rc1/CE/ubuntu-19.10-amd64/HPCC-Platform/system/tbb_sm/tbb/./include/tbb/concurrent_hash_map.h:127:51: warning: ‘void* memset(void*, int, size_t)’ clearing an object of type ‘class tbb::interface5::internal::hash_map_base’ with no trivial copy-assignment; use value-initialization instead [-Wclass-memaccess]
      10:26:31 127 | + embedded_buckets*sizeof(bucket) ); // n*8 or n*16
      10:26:31 | ^
      10:26:31 /mnt/disk1/jenkins/workspace/CE-Eoan-Plugins-7.6.6-rc1/CE/ubuntu-19.10-amd64/HPCC-Platform/system/tbb_sm/tbb/./include/tbb/concurrent_hash_map.h:79:11: note: ‘class tbb::interface5::internal::hash_map_base’ declared here
      10:26:31 79 | class hash_map_base {
      10:26:31 | ^~~~~~~~~~~~~
      10:27:12 /mnt/disk1/jenkins/workspace/CE-Eoan-Plugins-7.6.6-rc1/CE/ubuntu-19.10-amd64/HPCC-Platform/system/tbb_sm/tbb/./src/tbbmalloc/proxy.cpp:300:7: warning: ‘void* __libc_valloc(size_t)’ specifies less restrictive attributes than its target ‘void* valloc(size_t)’: ‘alloc_size’, ‘malloc’, ‘nothrow’ [-Wmissing-attributes]
      10:27:12 300 | void *_libc_valloc(size_t size) __attribute_ ((alias ("valloc")));
      10:27:12 | ^~~~~~~~~~~~~
      10:27:12 /mnt/disk1/jenkins/workspace/CE-Eoan-Plugins-7.6.6-rc1/CE/ubuntu-19.10-amd64/HPCC-Platform/system/tbb_sm/tbb/./src/tbbmalloc/proxy.cpp:231:14: note: ‘void* __libc_valloc(size_t)’ target declared here
      10:27:12 231 | void *PREFIX(valloc)(ZONE_ARG size_t size) __THROW
      10:27:12 | ^~~~~~
      10:27:12 /mnt/disk1/jenkins/workspace/CE-Eoan-Plugins-7.6.6-rc1/CE/ubuntu-19.10-amd64/HPCC-Platform/system/tbb_sm/tbb/./src/tbbmalloc/proxy.cpp:166:22: note: in definition of macro ‘PREFIX’
      10:27:12 166 | #define PREFIX(name) name
      10:27:12 | ^~~~
      10:27:12 /mnt/disk1/jenkins/workspace/CE-Eoan-Plugins-7.6.6-rc1/CE/ubuntu-19.10-amd64/HPCC-Platform/system/tbb_sm/tbb/./src/tbbmalloc/proxy.cpp:299:7: warning: ‘void* __libc_pvalloc(size_t)’ specifies less restrictive attributes than its target ‘void* pvalloc(size_t)’: ‘alloc_size’, ‘malloc’, ‘nothrow’ [-Wmissing-attributes]
      10:27:12 299 | void *_libc_pvalloc(size_t size) __attribute_ ((alias ("pvalloc")));
      10:27:12 | ^~~~~~~~~~~~~~
      10:27:12 /mnt/disk1/jenkins/workspace/CE-Eoan-Plugins-7.6.6-rc1/CE/ubuntu-19.10-amd64/HPCC-Platform/system/tbb_sm/tbb/./src/tbbmalloc/proxy.cpp:261:7: note: ‘void* __libc_pvalloc(size_t)’ target declared here
      10:27:12 261 | void *pvalloc(size_t size) __THROW
      10:27:12 | ^~~~~~~
      10:27:12 /mnt/disk1/jenkins/workspace/CE-Eoan-Plugins-7.6.6-rc1/CE/ubuntu-19.10-amd64/HPCC-Platform/system/tbb_sm/tbb/./src/tbbmalloc/proxy.cpp:298:7: warning: ‘void* __libc_memalign(size_t, size_t)’ specifies less restrictive attributes than its target ‘void* memalign(size_t, size_t)’: ‘alloc_size’, ‘malloc’, ‘nothrow’ [-Wmissing-attributes]
      10:27:12 298 | void *_libc_memalign(size_t alignment, size_t size) __attribute_ ((alias ("memalign")));
      10:27:12 | ^~~~~~~~~~~~~~~
      10:27:12 /mnt/disk1/jenkins/workspace/CE-Eoan-Plugins-7.6.6-rc1/CE/ubuntu-19.10-amd64/HPCC-Platform/system/tbb_sm/tbb/./src/tbbmalloc/proxy.cpp:225:14: note: ‘void* __libc_memalign(size_t, size_t)’ target declared here
      10:27:12 225 | void *PREFIX(memalign)(ZONE_ARG size_t alignment, size_t size) __THROW
      10:27:12 | ^~~~~~~~
      10:27:12 /mnt/disk1/jenkins/workspace/CE-Eoan-Plugins-7.6.6-rc1/CE/ubuntu-19.10-amd64/HPCC-Platform/system/tbb_sm/tbb/./src/tbbmalloc/proxy.cpp:166:22: note: in definition of macro ‘PREFIX’
      10:27:12 166 | #define PREFIX(name) name
      10:27:12 | ^~~~
      10:27:12 /mnt/disk1/jenkins/workspace/CE-Eoan-Plugins-7.6.6-rc1/CE/ubuntu-19.10-amd64/HPCC-Platform/system/tbb_sm/tbb/./src/tbbmalloc/proxy.cpp:297:7: warning: ‘void* __libc_calloc(size_t, size_t)’ specifies less restrictive attributes than its target ‘void* calloc(size_t, size_t)’: ‘alloc_size’, ‘leaf’, ‘malloc’, ‘nothrow’ [-Wmissing-attributes]
      10:27:12 297 | void *_libc_calloc(size_t num, size_t size) __attribute_ ((alias ("calloc")));
      10:27:12 | ^~~~~~~~~~~~~
      10:27:12 /mnt/disk1/jenkins/workspace/CE-Eoan-Plugins-7.6.6-rc1/CE/ubuntu-19.10-amd64/HPCC-Platform/system/tbb_sm/tbb/./src/tbbmalloc/proxy.cpp:205:14: note: ‘void* __libc_calloc(size_t, size_t)’ target declared here
      10:27:12 205 | void *PREFIX(calloc)(ZONE_ARG size_t num, size_t size) __THROW
      10:27:12 | ^~~~~~
      10:27:12 /mnt/disk1/jenkins/workspace/CE-Eoan-Plugins-7.6.6-rc1/CE/ubuntu-19.10-amd64/HPCC-Platform/system/tbb_sm/tbb/./src/tbbmalloc/proxy.cpp:166:22: note: in definition of macro ‘PREFIX’
      10:27:12 166 | #define PREFIX(name) name
      10:27:12 | ^~~~
      10:27:12 /mnt/disk1/jenkins/workspace/CE-Eoan-Plugins-7.6.6-rc1/CE/ubuntu-19.10-amd64/HPCC-Platform/system/tbb_sm/tbb/./src/tbbmalloc/proxy.cpp:296:7: warning: ‘void* __libc_malloc(size_t)’ specifies less restrictive attributes than its target ‘void* malloc(size_t)’: ‘alloc_size’, ‘leaf’, ‘malloc’, ‘nothrow’ [-Wmissing-attributes]
      10:27:12 296 | void *_libc_malloc(size_t size) __attribute_ ((alias ("malloc")));
      10:27:12 | ^~~~~~~~~~~~~
      10:27:12 /mnt/disk1/jenkins/workspace/CE-Eoan-Plugins-7.6.6-rc1/CE/ubuntu-19.10-amd64/HPCC-Platform/system/tbb_sm/tbb/./src/tbbmalloc/proxy.cpp:200:14: note: ‘void* __libc_malloc(size_t)’ target declared here
      10:27:12 200 | void *PREFIX(malloc)(ZONE_ARG size_t size) __THROW
      10:27:12 | ^~~~~~
      10:27:12 /mnt/disk1/jenkins/workspace/CE-Eoan-Plugins-7.6.6-rc1/CE/ubuntu-19.10-amd64/HPCC-Platform/system/tbb_sm/tbb/./src/tbbmalloc/proxy.cpp:166:22: note: in definition of macro ‘PREFIX’
      10:27:12 166 | #define PREFIX(name) name
      10:27:12 | ^~~~
      10:27:12 /mnt/disk1/jenkins/workspace/CE-Eoan-Plugins-7.6.6-rc1/CE/ubuntu-19.10-amd64/HPCC-Platform/system/tbb_sm/tbb/./src/tbbmalloc/proxy.cpp:149:18: warning: ‘void* __TBB_malloc_proxy(size_t)’ specifies less restrictive attributes than its target ‘void* malloc(size_t)’: ‘alloc_size’, ‘leaf’, ‘malloc’, ‘nothrow’ [-Wmissing-attributes]
      10:27:12 149 | extern "C" void *_TBB_malloc_proxy(size_t) __attribute_ ((alias ("malloc")));
      10:27:12 | ^~~~~~~~~~~~~~~~~~
      10:27:12 /mnt/disk1/jenkins/workspace/CE-Eoan-Plugins-7.6.6-rc1/CE/ubuntu-19.10-amd64/HPCC-Platform/system/tbb_sm/tbb/./src/tbbmalloc/proxy.cpp:200:14: note: ‘void* __TBB_malloc_proxy(size_t)’ target declared here
      10:27:12 200 | void *PREFIX(malloc)(ZONE_ARG size_t size) __THROW
      10:27:12 | ^~~~~~
      10:27:12 /mnt/disk1/jenkins/workspace/CE-Eoan-Plugins-7.6.6-rc1/CE/ubuntu-19.10-amd64/HPCC-Platform/system/tbb_sm/tbb/./src/tbbmalloc/proxy.cpp:166:22: note: in definition of macro ‘PREFIX’
      10:27:12 166 | #define PREFIX(name) name
      10:27:12 | ^~~~
      10:27:20 /mnt/disk1/jenkins/workspace/CE-Eoan-Plugins-7.6.6-rc1/CE/ubuntu-19.10-amd64/HPCC-Platform/system/tbb_sm/tbb/./src/tbbmalloc/proxy.cpp:300:7: warning: ‘void* __libc_valloc(size_t)’ specifies less restrictive attributes than its target ‘void* valloc(size_t)’: ‘alloc_size’, ‘malloc’, ‘nothrow’ [-Wmissing-attributes]
      10:27:20 300 | void *_libc_valloc(size_t size) __attribute_ ((alias ("valloc")));
      10:27:20 | ^~~~~~~~~~~~~
      10:27:20 /mnt/disk1/jenkins/workspace/CE-Eoan-Plugins-7.6.6-rc1/CE/ubuntu-19.10-amd64/HPCC-Platform/system/tbb_sm/tbb/./src/tbbmalloc/proxy.cpp:231:14: note: ‘void* __libc_valloc(size_t)’ target declared here
      10:27:20 231 | void *PREFIX(valloc)(ZONE_ARG size_t size) __THROW
      10:27:20 | ^~~~~~
      10:27:20 /mnt/disk1/jenkins/workspace/CE-Eoan-Plugins-7.6.6-rc1/CE/ubuntu-19.10-amd64/HPCC-Platform/system/tbb_sm/tbb/./src/tbbmalloc/proxy.cpp:166:22: note: in definition of macro ‘PREFIX’
      10:27:20 166 | #define PREFIX(name) name
      10:27:20 | ^~~~
      10:27:20 /mnt/disk1/jenkins/workspace/CE-Eoan-Plugins-7.6.6-rc1/CE/ubuntu-19.10-amd64/HPCC-Platform/system/tbb_sm/tbb/./src/tbbmalloc/proxy.cpp:299:7: warning: ‘void* __libc_pvalloc(size_t)’ specifies less restrictive attributes than its target ‘void* pvalloc(size_t)’: ‘alloc_size’, ‘malloc’, ‘nothrow’ [-Wmissing-attributes]
      10:27:20 299 | void *_libc_pvalloc(size_t size) __attribute_ ((alias ("pvalloc")));
      10:27:20 | ^~~~~~~~~~~~~~
      10:27:20 /mnt/disk1/jenkins/workspace/CE-Eoan-Plugins-7.6.6-rc1/CE/ubuntu-19.10-amd64/HPCC-Platform/system/tbb_sm/tbb/./src/tbbmalloc/proxy.cpp:261:7: note: ‘void* __libc_pvalloc(size_t)’ target declared here
      10:27:20 261 | void *pvalloc(size_t size) __THROW
      10:27:20 | ^~~~~~~
      10:27:20 /mnt/disk1/jenkins/workspace/CE-Eoan-Plugins-7.6.6-rc1/CE/ubuntu-19.10-amd64/HPCC-Platform/system/tbb_sm/tbb/./src/tbbmalloc/proxy.cpp:298:7: warning: ‘void* __libc_memalign(size_t, size_t)’ specifies less restrictive attributes than its target ‘void* memalign(size_t, size_t)’: ‘alloc_size’, ‘malloc’, ‘nothrow’ [-Wmissing-attributes]
      10:27:20 298 | void *_libc_memalign(size_t alignment, size_t size) __attribute_ ((alias ("memalign")));
      10:27:20 | ^~~~~~~~~~~~~~~
      10:27:20 /mnt/disk1/jenkins/workspace/CE-Eoan-Plugins-7.6.6-rc1/CE/ubuntu-19.10-amd64/HPCC-Platform/system/tbb_sm/tbb/./src/tbbmalloc/proxy.cpp:225:14: note: ‘void* __libc_memalign(size_t, size_t)’ target declared here
      10:27:20 225 | void *PREFIX(memalign)(ZONE_ARG size_t alignment, size_t size) __THROW
      10:27:20 | ^~~~~~~~
      10:27:20 /mnt/disk1/jenkins/workspace/CE-Eoan-Plugins-7.6.6-rc1/CE/ubuntu-19.10-amd64/HPCC-Platform/system/tbb_sm/tbb/./src/tbbmalloc/proxy.cpp:166:22: note: in definition of macro ‘PREFIX’
      10:27:20 166 | #define PREFIX(name) name
      10:27:20 | ^~~~
      10:27:20 /mnt/disk1/jenkins/workspace/CE-Eoan-Plugins-7.6.6-rc1/CE/ubuntu-19.10-amd64/HPCC-Platform/system/tbb_sm/tbb/./src/tbbmalloc/proxy.cpp:297:7: warning: ‘void* __libc_calloc(size_t, size_t)’ specifies less restrictive attributes than its target ‘void* calloc(size_t, size_t)’: ‘alloc_size’, ‘leaf’, ‘malloc’, ‘nothrow’ [-Wmissing-attributes]
      10:27:20 297 | void *_libc_calloc(size_t num, size_t size) __attribute_ ((alias ("calloc")));
      10:27:20 | ^~~~~~~~~~~~~
      10:27:20 /mnt/disk1/jenkins/workspace/CE-Eoan-Plugins-7.6.6-rc1/CE/ubuntu-19.10-amd64/HPCC-Platform/system/tbb_sm/tbb/./src/tbbmalloc/proxy.cpp:205:14: note: ‘void* __libc_calloc(size_t, size_t)’ target declared here
      10:27:20 205 | void *PREFIX(calloc)(ZONE_ARG size_t num, size_t size) __THROW
      10:27:20 | ^~~~~~
      10:27:20 /mnt/disk1/jenkins/workspace/CE-Eoan-Plugins-7.6.6-rc1/CE/ubuntu-19.10-amd64/HPCC-Platform/system/tbb_sm/tbb/./src/tbbmalloc/proxy.cpp:166:22: note: in definition of macro ‘PREFIX’
      10:27:20 166 | #define PREFIX(name) name
      10:27:20 | ^~~~
      10:27:20 /mnt/disk1/jenkins/workspace/CE-Eoan-Plugins-7.6.6-rc1/CE/ubuntu-19.10-amd64/HPCC-Platform/system/tbb_sm/tbb/./src/tbbmalloc/proxy.cpp:296:7: warning: ‘void* __libc_malloc(size_t)’ specifies less restrictive attributes than its target ‘void* malloc(size_t)’: ‘alloc_size’, ‘leaf’, ‘malloc’, ‘nothrow’ [-Wmissing-attributes]
      10:27:20 296 | void *_libc_malloc(size_t size) __attribute_ ((alias ("malloc")));
      10:27:20 | ^~~~~~~~~~~~~
      10:27:20 /mnt/disk1/jenkins/workspace/CE-Eoan-Plugins-7.6.6-rc1/CE/ubuntu-19.10-amd64/HPCC-Platform/system/tbb_sm/tbb/./src/tbbmalloc/proxy.cpp:200:14: note: ‘void* __libc_malloc(size_t)’ target declared here
      10:27:20 200 | void *PREFIX(malloc)(ZONE_ARG size_t size) __THROW
      10:27:20 | ^~~~~~
      10:27:20 /mnt/disk1/jenkins/workspace/CE-Eoan-Plugins-7.6.6-rc1/CE/ubuntu-19.10-amd64/HPCC-Platform/system/tbb_sm/tbb/./src/tbbmalloc/proxy.cpp:166:22: note: in definition of macro ‘PREFIX’
      10:27:20 166 | #define PREFIX(name) name
      10:27:20 | ^~~~
      10:27:20 /mnt/disk1/jenkins/workspace/CE-Eoan-Plugins-7.6.6-rc1/CE/ubuntu-19.10-amd64/HPCC-Platform/system/tbb_sm/tbb/./src/tbbmalloc/proxy.cpp:149:18: warning: ‘void* __TBB_malloc_proxy(size_t)’ specifies less restrictive attributes than its target ‘void* malloc(size_t)’: ‘alloc_size’, ‘leaf’, ‘malloc’, ‘nothrow’ [-Wmissing-attributes]
      10:27:20 149 | extern "C" void *_TBB_malloc_proxy(size_t) __attribute_ ((alias ("malloc")));
      10:27:20 | ^~~~~~~~~~~~~~~~~~
      10:27:20 /mnt/disk1/jenkins/workspace/CE-Eoan-Plugins-7.6.6-rc1/CE/ubuntu-19.10-amd64/HPCC-Platform/system/tbb_sm/tbb/./src/tbbmalloc/proxy.cpp:200:14: note: ‘void* __TBB_malloc_proxy(size_t)’ target declared here
      10:27:20 200 | void *PREFIX(malloc)(ZONE_ARG size_t size) __THROW
      10:27:20 | ^~~~~~
      10:27:20 /mnt/disk1/jenkins/workspace/CE-Eoan-Plugins-7.6.6-rc1/CE/ubuntu-19.10-amd64/HPCC-Platform/system/tbb_sm/tbb/./src/tbbmalloc/proxy.cpp:166:22: note: in definition of macro ‘PREFIX’
      10:27:20 166 | #define PREFIX(name) name
      10:27:20 | ^~~~
      10:27:20 [ 25%] Built target tbb
      10:27:20 make: *** [Makefile:163: all] Error 2

        Attachments

          Activity

            People

            • Assignee:
              ghalliday Gavin Halliday
              Reporter:
              xwang2713 Xiaoming Wang
            • Votes:
              0 Vote for this issue
              Watchers:
              2 Start watching this issue

              Dates

              • Created:
                Updated:
                Resolved: