Uploaded image for project: 'HPCC'
  1. HPCC
  2. HPCC-21616

Some javaembed_ex* test failed in OBT.

    XMLWordPrintable

    Details

    • Type: Bug
    • Status: Resolved
    • Priority: Major
    • Resolution: Fixed
    • Affects Version/s: 7.2.0
    • Fix Version/s: 7.2.0
    • Component/s: Plugins
    • Labels:
      None
    • Environment:
      OBT
      Build on git branch: candidate-7.2.x
      Date: Wed Mar 6 15:24:34 2019
      SHA: 5C5D2F11 (b45d04256ce043ba4353881b30e95010)
      Build type: RelWithDebInfo
      Number of Thor slaves: 4
      Number of channels per Thor slave: 1

      Description

       
      The problems are:
       

       

      Test case Error message WUID
           
      372. javaembed_ex3 Command return code non-zero/home/centos/build/CE/platform/HPCC-Platform-candidate-7:2:x-2019-03-07_04-34-57/testing/regress/ecl/javaembed_ex3:ecl(26,1): error C2405: cannot find symbol
      /home/centos/build/CE/platform/HPCC-Platform-candidate-7:2:x-2019-03-07_04-34-57/testing/regress/ecl/javaembed_ex3:ecl(26,1): error C2405: return a + c;
      /home/centos/build/CE/platform/HPCC-Platform-candidate-7:2:x-2019-03-07_04-34-57/testing/regress/ecl/javaembed_ex3:ecl(26,1): error C2405: ^
      /home/centos/build/CE/platform/HPCC-Platform-candidate-7:2:x-2019-03-07_04-34-57/testing/regress/ecl/javaembed_ex3:ecl(26,1): error C2405: symbol: variable c
      /home/centos/build/CE/platform/HPCC-Platform-candidate-7:2:x-2019-03-07_04-34-57/testing/regress/ecl/javaembed_ex3:ecl(26,1): error C2405: location: class embed
      /home/centos/build/CE/platform/HPCC-Platform-candidate-7:2:x-2019-03-07_04-34-57/testing/regress/ecl/javaembed_ex3:ecl(28,10): error C3001: Too many errors (max = 5); Aborting:::
      6 errors, 0 warning
      No ZAP file generated.
      370. javaembed_ex13 Result doesn't match to key file
      — javaembed_ex13.xml
      +++ javaembed_ex13.xml
      @@ -1,3 +1,5 @@
      -1,140685048029976
      -3,140685048029976
      -6,140685048029976
      +<Dataset name='Result 1'>
      + <Row><i>1</i><p>59428744</p></Row>
      + <Row><i>3</i><p>59428744</p></Row>
      + <Row><i>6</i><p>59428744</p></Row>
      +</Dataset>
      W20190307-070529
      373. javaembed_ex4 Result doesn't match to key file
      — javaembed_ex4.xml
      +++ javaembed_ex4.xml
      @@ -1,1 +1,3 @@
      -Hello Java
      +<Dataset name='Result 1'>
      + <Row><Result_1>Hello Java</Result_1></Row>
      +</Dataset>
      W20190307-070533

        Attachments

          Activity

            People

            • Assignee:
              richardkchapman Richard Chapman
              Reporter:
              attilavamos Attila Vamos
            • Votes:
              0 Vote for this issue
              Watchers:
              2 Start watching this issue

              Dates

              • Created:
                Updated:
                Resolved: