Uploaded image for project: 'HPCC'
  1. HPCC
  2. HPCC-17624

Both distributeddataset.ecl and streamread.ecl fails with syntax error in regression test.

    XMLWordPrintable

    Details

    • Type: Regression
    • Status: Resolved
    • Priority: Critical
    • Resolution: Fixed
    • Affects Version/s: 6.4.0
    • Fix Version/s: 6.4.0
    • Component/s: Regression Suite
    • Labels:
      None
    • Environment:
      All

      Description

      Both test cases fails on all target with syntax errors.

      ./ecl-test query distribute* streamread* 
      [Action] Suite: hthor
      [Action] Queries: 2
      [Action]   1. Test: distributeddataset.ecl
      [Failure]   1. Fail No WUID (0 sec)
      [Action]   2. Test: streamread.ecl
      [Failure]   2. Fail No WUID (0 sec)
      [Action] 
          -------------------------------------------------
          Result:
          Passing: 0
          Failure: 2
          -------------------------------------------------
          Error:
            1. Test: distributeddataset.ecl
            eclcc returns with:
          	'Error (1001): Command return code non-zero. 
          	 retCode: 2
          	\/home/ati/HPCC-Platform/testing/regress/ecl/distributeddataset.ecl(49,8): error C3002: syntax error near = : expected :=
          	/home/ati/HPCC-Platform/testing/regress/ecl/distributeddataset.ecl(50,20): error C2167: Unknown identifier copies
          	2 errors, 0 warning
          	\'
          	'
            2. Test: streamread.ecl
            eclcc returns with:
          	'Error (1001): Command return code non-zero. 
          	 retCode: 2
          	\/home/ati/HPCC-Platform/testing/regress/ecl/streamread.ecl(20,8): error C3002: syntax error near = : expected :=
          	/home/ati/HPCC-Platform/testing/regress/ecl/streamread.ecl(69,13): error C2167: Unknown identifier copies
          	/home/ati/HPCC-Platform/testing/regress/ecl/streamread.ecl(89,17): error C2167: Unknown identifier copies
          	/home/ati/HPCC-Platform/testing/regress/ecl/streamread.ecl(104,18): error C2167: Unknown identifier copies
          	4 errors, 0 warning
          	\'
          	'
          -------------------------------------------------
          Log: /home/ati/HPCCSystems-regression/log/hthor.17-05-13-13-53-08.log
          -------------------------------------------------
          Elapsed time: 3 sec  (00:00:03) 
          -------------------------------------------------
      

        Attachments

          Activity

            People

            • Assignee:
              attilavamos Attila Vamos
              Reporter:
              attilavamos Attila Vamos
            • Votes:
              0 Vote for this issue
              Watchers:
              1 Start watching this issue

              Dates

              • Created:
                Updated:
                Resolved: